{"text_format":"1","workbook":"xlsx","n_sheets":12,"sheets":["Hidden","Contact Details","Q1-3","Q4","Q5","Q6","Q7-9","Q10","Q11","Classes of non-life insurance","Definitions","Description of asset classes"],"not_rendered":{"charts":0,"images":1,"macros":1,"external_links":4,"defined_names":39,"comments":0,"pivot_tables":0},"unopened":[],"bounds":{"document_bytes":16777216,"sheet_cells":100000,"rows_first":2000,"rows_last":500,"rows_between":2000,"halvings":0,"cell_chars":16384,"cell_head_chars":4096},"cells_cut":0,"cells_raw":0,"read":"whole","date_system":"1900"}

{"sheet":"Hidden","index":0,"n_rows":132,"n_cols":8,"rows_kept":132,"cut":false,"hidden":true,"merged":[]}
["Do not make any data changes on this sheet (Internal Reserved Use)"]
[]
["Workbook",null,"Countries","CountryIndex","Settings","Currency","Units","Valuation method"]
["ErrorTolerance",0.05,null,1,{"$f":"IF(CountryIndex=1,\"\",INDEX(Countries,CountryIndex,1))","v":""}]
[null,null,"Albania",55,{"$f":"IF(currencyIndex=1,\"\",INDEX(Hidden!$F$4:$F$132,CountryIndex,1))","v":0},"ALL","Units","Book value"]
[null,null,"Antigua and Barbuda",5,{"$f":"IF(unitindex=1,\"\",INDEX(Hidden!$G$4:$G$9,unitindex,1))","v":"Millions"},"XCD","Hundreds","Mark-to-market"]
[null,null,"Argentina",1,{"$f":"IF(ValueIndex=1,\"\",INDEX(H4:H6,ValueIndex,1))","v":""},"ARS","Thousands"]
[null,null,"Armenia",null,null,"AMD","Millions"]
[null,null,"Australia",null,null,"AUD","Billions"]
[null,null,"Austria",null,null,"EUR"]
[null,null,"Bangladesh",null,null,"BDT"]
[null,null,"Barbados",null,null,"BBD"]
[null,null,"Belgium",null,null,"EUR"]
[null,null,"Belize",null,null,"BZD"]
[null,null,"Bhutan",null,null,"BTN"]
[null,null,"Bolivia",null,null,"BOB"]
[null,null,"Botswana",null,null,"BWP"]
[null,null,"Brazil",null,null,"BRL"]
[null,null,"Brunei",null,null,"BND"]
[null,null,"Bulgaria",null,null,"BGN"]
{"$rows_left_out":113}
{"sheet":"Contact Details","index":1,"n_rows":45,"n_cols":8,"rows_kept":45,"cut":false,"hidden":false,"merged":[[39,3,39,10],[33,0,34,10],[38,12,38,13],[27,0,27,10],[37,0,37,10],[38,0,38,2],[39,0,39,2],[38,3,38,10],[29,0,31,10]]}
[]
[]
[null,null,null,"Insurer and long-term investment"]
[]
[null,null,null,"OECD data collection from large insurance companies"]
[]
["Contact details"]
[]
["Name of the insurance company"]
[]
["Country"]
[]
["Name of Regulatory Authority"]
[]
["Survey completed by"]
[]
["Name"]
[]
["Position in the institution"]
[]
{"$rows_left_out":26}
{"sheet":"Q1-3","index":2,"n_rows":40,"n_cols":7,"rows_kept":40,"cut":false,"hidden":false,"merged":[[6,0,6,5],[18,0,20,0],[25,0,26,0],[31,0,32,5]]}
[]
["Country:",{"$f":"Country","v":""}]
["Currency:",{"$f":"Currency","v":0}]
[]
["See definitions"]
[null,null,null,null,null,null,"Answer"]
["1. What type of business does your insurance company manage? (Life / Non-life / Composite / Reinsurance)"]
[]
["For the definition of classes of non-life insurance, see the worksheet ",null,null,null,"Classes of non-life insurance"]
[]
["1.a. What is the reporting level of the data provided in this survey?"]
[]
["select from drop-down menu:","Consolidated"]
[]
["2. Business Written in the Reporting Country"]
["In millions of national currency"]
[]
["a) Direct insurers",null,2014,2015]
["Gross written premiums","Direct business"]
[null,"Reinsurance accepted"]
{"$rows_left_out":21}
{"sheet":"Q4","index":3,"n_rows":58,"n_cols":6,"rows_kept":58,"cut":false,"hidden":false,"merged":[[10,4,10,5],[30,0,30,3],[34,0,34,3],[18,0,18,3],[29,0,29,3],[20,0,20,3],[22,0,22,3],[21,0,21,3],[28,0,28,3],[23,0,23,3],[14,0,14,3],[19,0,19,3],[10,0,11,3],[12,0,12,3],[13,0,13,3],[15,0,15,3],[16,0,16,3],[58,0,60,8],[44,0,44,8],[46,0,47,8],[53,0,54,8],[36,0,36,3],[51,0,52,8],[37,0,37,3],[48,0,49,8],[39,0,39,3],[33,0,33,3],[32,0,32,3],[35,0,35,3],[17,0,17,3]]}
[]
["Country:",{"$f":"Country","v":""}]
["Currency:",{"$f":"Currency","v":0},null,null,{"$f":"Method","v":""}]
[]
[]
["4. Asset allocation at the calendar year end of 2014 and 2015 (general/own account portfolio assets)"]
[]
["Note: Investments in mutual funds (Collective Investment Schemes) should be broken out and reallocated to the asset classes as shown in the table below. (If this is not possible, please place in other investments)"]
["For definitions of asset classes, please refer to ",null,null,null,"Description of asset classes"]
[]
[null,null,null,null,"Assets\nIn millions of national currency"]
[null,null,null,null,"End-2014","End-2015"]
["INVESTMENTS (a)\n(a)=(1) + (2) + (3) + (4) + (5) + (6) + (7) + (8) + (9) + (10)"]
["Cash and deposits (1)"]
["Fixed income* (2)"]
["Breakdown by type"]
["Government issued securities"]
["Of which: Investment grade"]
["Corporate issued securities"]
["Of which: Investment grade"]
{"$rows_left_out":39}
{"sheet":"Q5","index":4,"n_rows":40,"n_cols":15,"rows_kept":40,"cut":false,"hidden":false,"merged":[[27,5,28,5],[33,0,33,3],[27,0,28,3],[32,0,32,3],[37,0,37,3],[29,0,29,3],[30,0,30,3],[31,0,31,3],[36,0,36,3],[16,0,16,3],[17,0,17,3],[18,0,18,3],[19,0,19,3],[34,0,34,3],[20,0,20,3],[21,0,21,3],[22,0,22,3],[23,0,23,3],[3,4,3,8],[26,7,26,14],[41,0,42,14],[11,0,12,3],[11,4,12,4],[11,5,12,5],[11,7,11,14],[13,0,13,3],[14,0,14,3],[15,0,15,3],[38,0,38,3],[39,0,39,3],[27,4,28,4],[10,7,10,14],[27,7,27,14],[35,0,35,3]]}
[]
["Country:",{"$f":"Country","v":""}]
["Currency:",{"$f":"Currency","v":0},null,null,{"$f":"Method","v":""}]
[]
["Description of asset classes"]
[]
["5. Asset allocation by destination of investments and asset class at the calendar year end of 2014 and 2015"]
["In millions of national currency"]
[]
[]
[null,null,null,null,null,null,null,"Year End-2014"]
[null,null,null,null,"Domestic^","Foreign^"]
[null,null,null,null,null,null,"Total","North America (US, Canada)","Latin America and Caribbean","European Union","Other European countries and Russia","Middle East","Africa","Japan, Korea, Australia, New Zealand","Other Asian countries"]
["Cash and deposits"]
["Fixed income"]
["Loans"]
["Listed equity"]
["Land and buildings"]
["Private equity"]
["Unlisted infrastructure equity"]
{"$rows_left_out":21}
{"sheet":"Q6","index":5,"n_rows":34,"n_cols":5,"rows_kept":34,"cut":false,"hidden":false,"merged":[[33,0,33,6],[34,0,37,6],[28,0,31,6],[27,0,27,6],[4,0,4,6],[13,0,13,2],[21,0,21,2],[17,0,17,2],[18,0,18,2],[7,0,7,4],[22,0,22,2],[23,0,23,2],[9,0,9,2],[24,0,24,2],[20,0,20,2],[16,0,16,2],[19,0,19,2],[10,0,10,2],[11,0,11,2],[12,0,12,2],[14,0,14,2],[15,0,15,2]]}
[]
["Country:",{"$f":"Country","v":""}]
["Currency:",{"$f":"Currency","v":0}]
[]
["6. Please describe the insurance company's target asset allocation (e.g. 40% equities, 50% bonds, 10% land and buildings) for the year end 2016 and for the longer term"]
["As a % of total assets"]
[]
["Longer term refers to the plan's long-term strategic asset allocation. The target allocation at year end 2016 would be different if a near-term asset allocation target was in effect."]
[]
["Asset class",null,null,"Year end 2016","Longer term"]
["Cash and deposits (1)"]
["Fixed-income (2)"]
["Of which: Government issued securities"]
["Corporate issued securities"]
["Structured products (including securitisations)"]
["Loans"]
["Listed equity (3)"]
["Alternative investment (4)"]
["Of which: Land and buildings"]
["                  Private equity"]
{"$rows_left_out":15}
{"sheet":"Q7-9","index":6,"n_rows":80,"n_cols":12,"rows_kept":80,"cut":false,"hidden":false,"merged":[[66,0,66,1],[61,0,61,1],[31,0,33,7],[43,0,45,7],[80,0,82,6],[76,0,76,1],[68,0,68,1],[69,0,69,1],[70,0,70,1],[73,0,73,1],[74,0,74,1],[62,0,62,1],[67,0,67,1],[63,0,63,1],[64,0,64,1],[79,0,79,5],[5,0,5,5],[26,0,26,1],[28,0,28,1],[19,0,19,4],[27,0,27,1],[9,0,9,4],[23,0,24,1],[17,0,17,4],[11,0,11,4],[12,0,12,4],[15,0,15,4],[21,0,21,5],[25,0,25,1],[14,0,14,4],[18,0,18,4],[23,8,23,11],[57,7,57,10],[13,0,13,4],[7,0,7,4],[47,7,48,7],[37,0,37,1],[52,0,52,1],[50,0,50,1],[40,0,40,1],[42,0,42,3],[47,4,47,5],[51,0,51,1],[35,0,36,1],[49,0,49,1],[23,4,23,5],[35,4,35,5],[30,0,30,3],[55,0,55,7],[57,0,58,1],[23,2,23,3],[35,2,35,3],[47,2,47,3],[23,7,24,7],[35,7,36,7],[57,2,57,3],[57,4,57,5],[60,0,60,1],[39,0,39,1],[38,0,38,1],[47,0,48,1],[65,0,65,1]]}
[]
["Country:",{"$f":"Country","v":""}]
["Currency:",{"$f":"Currency","v":0}]
[]
[]
["The following question 7 is about your investment in infrastructure, using a broad definition of infrastructure based on physical characteristics (e.g. transport, utilities & energy, communications, social infrastructure) including all financial instruments. Further breakdown by financial instrument used is requested for question 8."]
[]
["7. Infrastructure Allocation Description (in Dec 2014, Dec 2015)",null,null,null,null,"Answer"]
[null,null,null,null,null,"End-2014","End-2015"]
["7.a Do you or did you have infrastructure exposure? (Yes/No - please specify for each year)                                                                                     (If NO then go to question 8.b)\n"]
[]
["- Do you or did you have a separate allocation to infrastructure? (Yes/No - please specify for each year)"]
["- Has your TARGET allocation increased, decreased or remained the same compared to the previous year? (Increased/Decreased/the same/ N.A.)"]
["- Has your ACTUAL allocation increased, decreased or remained the same compared to the previous year? (Increased/Decreased/the same/ N.A.)"]
["- Do you invest in greenfield projects? (Yes/No/Considering to invest) "]
["7.b If you do NOT have infrastructure exposure"]
[null,null,null,null,null,"Answer"]
["- Are you planning to adopt an infrastructure allocation in the next 1-2 years (Yes/No)"]
["- If you are not planning to adopt an infrastructure allocation in the future, please give further details on the main reasons for not investing"]
[]
{"$rows_left_out":61}
{"sheet":"Q10","index":7,"n_rows":36,"n_cols":5,"rows_kept":36,"cut":false,"hidden":false,"merged":[[37,0,39,5],[15,0,15,2],[16,0,16,2],[17,0,17,2],[35,0,35,4],[11,0,11,2],[12,0,12,2],[13,0,13,2],[14,0,14,2],[7,0,7,5]]}
[]
["Country:",{"$f":"Country","v":""}]
["Currency:",{"$f":"Currency","v":0}]
[]
[]
["10. \"Green\" investments",null,"Description of asset classes"]
[]
["Please indicate the amount invested in \"green\" investment products at the end of 2014 and 2015"]
["In millions of national currency"]
[]
[null,null,null,"End-2014","End-2015"]
["\"Green\" equity"]
["\"Green\" bonds"]
["Alternative \"green\" asset classes"]
["Other \"green\" investments (please specify below):"]
["                                                                                                   "]
["                                                                                                   "]
["                                                                                                   "]
[]
["Note: Examples of \"green\" investment products:"]
{"$rows_left_out":17}
{"sheet":"Q11","index":8,"n_rows":29,"n_cols":5,"rows_kept":29,"cut":false,"hidden":false,"merged":[[11,0,11,2],[19,0,19,5],[21,0,25,5],[28,0,44,4],[13,0,13,2],[14,0,14,2],[15,0,15,2],[16,0,16,2],[17,0,17,2]]}
[]
["Country:",{"$f":"Country","v":""},null,null,{"$f":"Type","v":""}]
["Currency:",{"$f":"Currency","v":0}]
[]
[]
["11. \"Social\" Investments",null,"Description of asset classes"]
[]
["Please indicate the amount invested in \"social\" investment products or strategies, social/development impact venture capital, and impact investments at the end of 2014 and 2015"]
["In millions of national currency"]
[]
[null,null,null,"End-2014","End-2015"]
["Social/development impact venture capital/SME finance"]
["Social impact bonds/Development impact bonds"]
["Other social investments (please specify below):"]
[]
["                                                                                                   "]
["                                                                                                   "]
["                                                                                                   "]
[]
["What is your definition of social impact investments? Do you have a specific target allocation, policy, mandate, or statute that requires allocations to certain social investments?"]
{"$rows_left_out":10}
{"sheet":"Classes of non-life insurance","index":9,"n_rows":92,"n_cols":3,"rows_kept":92,"cut":false,"hidden":false,"merged":[[13,2,13,8],[28,2,28,8],[31,2,31,8],[34,2,34,8],[43,2,43,8]]}
[]
[]
[null,"DEFINITIONS OF CLASSES OF NON LIFE INSURANCE"]
[null,"(Definitions are based on OECD common classification of the classes of insurance)"]
[]
[null,"Classes","Definitions"]
[]
[null,"1. MOTOR VEHICLE","LAND VEHICLES (other than railway rolling stock)"]
[null,null,"All damage to or loss of:"]
[null,null,"- Land motor vehicles,"]
[null,null,"- Land vehicles other than motor vehicles."]
[]
[null,null,"MOTOR VEHICLE LIABILITY"]
[null,null,"All liability arising out of the use of motor vehicles operating on land (including carriers' liability)."]
[]
[null,"2. TRANSPORT","RAILWAY ROLLING STOCK AND OTHER TRANSPORT"]
[null,null,"All damage to or loss of railway rolling stock."]
[]
[null,null,"AIRCRAFT"]
[null,null,"All damage to or loss of aircraft."]
{"$rows_left_out":73}
{"sheet":"Definitions","index":10,"n_rows":18,"n_cols":2,"rows_kept":18,"cut":false,"hidden":false,"merged":[]}
[]
["Definitions"]
[]
["Term","Definition"]
["Unit-linked product","Also called Unit Linked Insurance Plan (ULIP), a type of insurance vehicle in which the policyholder purchases units in investment funds at their net asset values and can choose from a range of different funds to suit his/her attitude to risk. Investment funds are invested in a mix of assets (such as stock, bonds or mutual funds, depending upon the list of qualified investments). Depending on the performance of the fund chosen, the policyholder may achieve gains or losses on his/her investments."]
["Gross premiums","Gross premiums are total premiums written, excluding any premium taxes or other charges, but before deduction of commissions or reinsurance outwards. "]
["Direct business","Includes all direct business."]
["Reinsurance accepted","Includes all reinsurance business accepted. Facultative reinsurance may be included under \"Direct business\" or \"Reinsurance Accepted\" according to practice in the reporting country."]
["Total gross premiums","This is the total of the two previous rows. The figure should be given even if it has not been possible to make the split between Direct and Reinsurance business."]
["Premiums ceded","Includes all premiums (reinsurance and retrocession) ceded."]
["Net written premiums","Normally \"Net Written Premiums\" should be equal to total \"Total gross Premiums\" less \"Premiums Ceded\". If there are special problems which prevent this relationship from holding given the definitions provided, then appropriate compensatory element should be included under \"Premiums Ceded\" so that it does not hold in the figures supplied."]
["Gross claims paid","Gross claims payments, covering all gross payments on claims made during the financial year, are to be used in the calculation of gross claims incurred."]
["Gross operating expenses","Gross operating expenses should normally mean the sum of acquisition costs, change in deferred acquisition costs and administrative expenses."]
["Shareholder equity","Shareholder equity represents the net worth of a company after deducting all liabilities."]
["Net income","Net income is the profit, or total earnings, recorded by a company."]
["Gross investment return (nominal)","Total return, including realized and unrealized gains and losses (based on market values) plus income, before discounting any investment management costs and using a time-weighted calculation methodology. The return should be given in nominal terms (before inflation) and in percent."]
["Net investment return (nominal)","Total return, including realized and unrealized gains and losses (based on market values) plus income, after discounting any investment management costs and using a time-weighted calculation methodology. The return should be given in nominal terms (before inflation) and in percent."]
["Derivatives","Financial derivatives are financial instruments that are linked to a specific financial instrument or indicator or commodity, and through which specific financial risks can be traded in financial markets in their own right; their value derives from the price of the underlying item (i.e. the reference price) and, unlike debt instruments, no principal amount is advanced to be repaid and no investment income accrues. "]

{"sheet":"Description of asset classes","index":11,"n_rows":57,"n_cols":5,"rows_kept":57,"cut":false,"hidden":false,"merged":[[26,0,26,3],[25,0,25,3],[24,0,24,3],[4,0,4,3],[6,0,6,3],[10,0,10,3],[12,0,12,3],[7,0,7,3],[8,0,8,3],[9,0,9,3],[13,0,13,3],[11,0,11,3],[14,0,14,3],[21,0,21,3],[23,0,23,3],[15,0,15,3],[22,0,22,3],[16,0,16,3],[17,0,17,3],[18,0,18,3],[19,0,19,3],[20,0,20,3],[45,0,45,3],[38,0,38,3],[40,0,40,3],[42,0,42,3],[43,0,43,3],[44,0,44,3],[41,0,41,3],[37,0,37,3],[27,0,27,3],[30,0,30,3],[32,0,32,3],[29,0,29,3],[28,0,28,3],[31,0,31,3]]}
[]
["Description of asset classes used in the questionnaire"]
["You will find below descriptions of asset classes included in this questionnaire."]
[]
["Asset class",null,null,null,"Definition"]
["INVESTMENTS",null,null,null,"All forms of investment with a value associated to an insurance company. This total should be the sum of the following asset classes: \"Cash and deposits\", \"Fixed income\", \"Loans\", \"Listed equity\", \"Land and buildings\", \"Private equity\", \"Unlisted infrastructure investment\", \"Hedge funds\", \"Commodities\" and \"Other investments\"."]
["Cash and deposits",null,null,null,"Cash are current account and other short-term savings in the financial system. Deposits are funds 'placed on deposit' with a financial institution and do not include certificates of deposit or other short-term securities. Includes cash underlying derivative positions but does not include notional value of long/short derivative positions"]
["Fixed income",null,null,null,"Bills and bonds issued or guaranteed by central and local governments and the National Debt offices as well as securities/bills issued by companies, including financial and non-financial enterprises, and securitisations."]
["Breakdown by type"]
["Government issued securities",null,null,null,"Bills and bonds issued or guaranteed by central and local governments and the National Debt Offices (Long term and short term), and structured products."]
["Of which: Investment grade",null,null,null,"Government securities which have a high bond rating such as BBB- or above."]
["Corporate issued securities",null,null,null,"Securities/bills issued by companies, financial and non-financial enterprises. Bonds issued by banks and other financial institutions."]
["Of which: Investment grade",null,null,null,"Corporate securities which have a high bond rating such as BBB- or above"]
["Securitisations",null,null,null,"Pooling various types of contractual debt such as residential mortgages, commercial mortgages, auto loans or credit card debt obligations (or other non-debt assets which generate receivables) and selling their related cash flows to third party investors as securities, which may be described as bonds, pass-through securities, or collateralized debt obligations (CDOs)."]
["Of which: Asset-backed securities",null,null,null,"Securities collateralized by loans, leases, unsecured receivables, or instalment contracts on personal property, automobiles, or credit cards. The cash flows generated by the underlying obligations are used to pay principal and interest to the asset-backed security holders."]
["Of which: Mortgage-backed securities",null,null,null,"Securities backed by mortgages, including pass-through securities, mortgage-backed bonds, mortgage pay-through securities, and collateralized mortgage obligations."]
["Other fixed income",null,null,null,"fixed income instruments that do not fit into the previous three categories (government, corporate and securitisations). "]
["Memo items"]
["Inflation-indexed bonds",null,null,null,"Bonds where the principal is indexed to inflation."]
["Municipal bonds",null,null,null,"Bonds issued by local governments. This line item should include general obligations, revenue bonds, taxable and non-taxable issues. Infrastructure related municipal bonds should also be included."]
{"$rows_left_out":37}